BDBM141255 US8653100, 149
SMILES CN(C)CCS(=O)(=O)NCCOc1ccc2CCNC(c2c1)C1(CCC1)c1ccc(Cl)cc1
InChI Key InChIKey=SLZRQHPTDIRHGH-UHFFFAOYSA-N
Data  1 KI
  Tab Delimited (TSV)   2D SDfile   Computed 3D by Vconf -m prep SDfile
Find this compound or compounds like it in BindingDB:
Activity Spreadsheet -- Enzyme Inhibition Constant Data from BindingDB
Found 1 hit for monomerid = 141255
TargetSodium- and chloride-dependent glycine transporter 1(Homo sapiens (Human))
Abbvie
US Patent
LigandPNGBDBM141255(US8653100, 149)
Affinity DataKi: <100nMpH: 7.5Assay Description:Radioligand binding to human GlyT1c transporter-expressing membranes was carried out as described in Mezler et al., Molecular Pharmacology 74:1705-17...
In DepthDetails US Patent