BDBM141333 US8916577, 27
SMILES CCc1cccc(C)c1NC(=O)c1nn(C)c-2c1CCCc1cnc(Nc3ccc(cc3OC)N3CCN(C)CC3)nc-21
InChI Key InChIKey=HFJRLKADRDLRQP-UHFFFAOYSA-N
Data  1 IC50
  Tab Delimited (TSV)   2D SDfile   Computed 3D by Vconf -m prep SDfile
Find this compound or compounds like it in BindingDB:
Activity Spreadsheet -- Enzyme Inhibition Constant Data from BindingDB
Found 1 hit for monomerid = 141333
TargetDual specificity protein kinase TTK(Homo sapiens (Human))
Nerviano Medical Sciences
US Patent
LigandPNGBDBM141333(US8916577, 27)
Affinity DataIC50:  189nMpH: 3.0Assay Description:The inhibitory activity of putative kinase inhibitors and the potency of selected compounds were determined using a trans-phosphorylation assay.Speci...
In DepthDetails US Patent