BDBM141335 US8916577, 97
SMILES CCc1cccc(CC)c1NC(=O)c1c2CCCc3cnc(Nc4ccc(cc4OC)N4CCN(C)CC4)nc3-c2nn1C
InChI Key InChIKey=NGSWZHUXTMIEEP-UHFFFAOYSA-N
Data  1 IC50
  Tab Delimited (TSV)   2D SDfile   Computed 3D by Vconf -m prep SDfile
Find this compound or compounds like it in BindingDB:
Activity Spreadsheet -- Enzyme Inhibition Constant Data from BindingDB
Found 1 hit for monomerid = 141335
TargetDual specificity protein kinase TTK(Homo sapiens (Human))
Nerviano Medical Sciences
US Patent
LigandPNGBDBM141335(US8916577, 97)
Affinity DataIC50:  853nMpH: 3.0Assay Description:The inhibitory activity of putative kinase inhibitors and the potency of selected compounds were determined using a trans-phosphorylation assay.Speci...
In DepthDetails US Patent