BDBM141437 US10668051, Compound Example 101::US8921364, 101
SMILES Cc1nnsc1C(=O)Nc1ccc(nc1)-n1nc(cc1C1CC1)C(F)(F)F
InChI Key InChIKey=FECPMVWBSZDHPR-UHFFFAOYSA-N
Data  2 IC50
  Tab Delimited (TSV)   2D SDfile   Computed 3D by Vconf -m prep SDfile
Find this compound or compounds like it in BindingDB:
Activity Spreadsheet -- Enzyme Inhibition Constant Data from BindingDB
Found 2 hits for monomerid = 141437
TargetCalcium release-activated calcium channel protein 1(Homo sapiens (Human))
Rhizen Pharmaceuticals
US Patent
LigandPNGBDBM141437(US10668051, Compound Example 101 | US8921364, 101)
Affinity DataIC50:  150nM. Assay description: Inhibition of CRAC channels was determined following thapsigargin (Sigma, Cat #T9033) induced endoplasmic calcium release in Jurkat cells, (see Yasur...
Ligand InfoPC cidPC sid
In DepthDetails US Patent
TargetEF-hand calcium-binding domain-containing protein 4B(Homo sapiens (Human))
Rhizen Pharmaceuticals
US Patent
LigandPNGBDBM141437(US10668051, Compound Example 101 | US8921364, 101)
Affinity DataIC50:  150nMT: 2°C. Assay description: Inhibition of CRAC channels was determined following thapsigargin (Sigma, Cat # T9033) induced endoplasmic calcium release in Jurkat cells. (see Yasu...
Ligand InfoPC cidPC sid
In DepthDetails US Patent