BDBM141574 US8921389, 30::US9695170 30
SMILES OC(=O)CCCCNC(=O)c1ncc2c(ccn(Cc3ccccc3)c2=O)c1O
InChI Key InChIKey=XOXNTBYBLRPNQX-UHFFFAOYSA-N
Data  2 IC50
  Tab Delimited (TSV)   2D SDfile   Computed 3D by Vconf -m prep SDfile
Find this compound or compounds like it in BindingDB:
Activity Spreadsheet -- Enzyme Inhibition Constant Data from BindingDB
Found 2 hits for monomerid = 141574
TargetEgl nine homolog 1(Homo sapiens (Human))
Fibrogen
US Patent
LigandPNGBDBM141574(US8921389, 30 | US9695170 30)
Affinity DataIC50:  660nMpH: 7.4Assay Description:Ketoglutaric acid α-[1-14C]-sodium salt, alpha-ketoglutaric acid sodium salt, and HPLC purified peptide may be obtained from commercial sources...
In DepthDetails US Patent
TargetEgl nine homolog 1(Homo sapiens (Human))
Fibrogen
US Patent
LigandPNGBDBM141574(US8921389, 30 | US9695170 30)
Affinity DataIC50:  660nMpH: 7.4Assay Description:Ketoglutaric acid alpha -[1-14C]-sodium salt, alpha-ketoglutaric acid sodium salt, and HPLC purified peptide may be obtained from commercial sources,...
In DepthDetails US Patent