BDBM14177 3,13-diazahexacyclo[14.7.0.0^{2,10}.0^{4,9}.0^{11,15}.0^{17,22}]tricosa-1(16),2(10),4(9),5,7,11(15),17(22),18,20-nonaen-14-one::CHEMBL357490::Pyrrolocarbazole Analog 6
SMILES O=C1NCc2c1c-1c(Cc3ccccc-13)c1[nH]c3ccccc3c21
InChI Key InChIKey=NBGYLHIDCLVBHE-UHFFFAOYSA-N
Data  4 IC50
  Tab Delimited (TSV)   2D SDfile   Computed 3D by Vconf -m prep SDfile
Find this compound or compounds like it in BindingDB:
Activity Spreadsheet -- Enzyme Inhibition Constant Data from BindingDB
Found 4 hits for monomerid = 14177
TargetMitogen-activated protein kinase kinase kinase 9(Homo sapiens (Human))
Cephalon
LigandPNGBDBM14177(3,13-diazahexacyclo[14.7.0.0^{2,10}.0^{4,9}.0^{11,...)
Affinity DataIC50:  69nMpH: 7.2 T: 2°C. Assay description: The MLK1, MLK2, and MLK3 assays were performed using the Millipore multiscreen trichloroacetic acid (TCA) in-plate format. IC50 values were calculate...
In DepthDetails ArticlePubMed
TargetVascular endothelial growth factor receptor 2(Homo sapiens (Human))
Cephalon
Curated by ChEMBL
LigandPNGBDBM14177(3,13-diazahexacyclo[14.7.0.0^{2,10}.0^{4,9}.0^{11,...)
Affinity DataIC50:  110nM. Assay description: Inhibition of human Vascular endothelial growth factor receptor 2
In DepthDetails ArticlePubMed
TargetMitogen-activated protein kinase kinase kinase 10(Homo sapiens (Human))
Cephalon
LigandPNGBDBM14177(3,13-diazahexacyclo[14.7.0.0^{2,10}.0^{4,9}.0^{11,...)
Affinity DataIC50:  364nM. Assay description: The MLK1, MLK2, and MLK3 assays were performed using the Millipore multiscreen trichloroacetic acid (TCA) in-plate format. IC50 values were calculate...
In DepthDetails ArticlePubMed
TargetMitogen-activated protein kinase kinase kinase 11(Homo sapiens (Human))
Cephalon
LigandPNGBDBM14177(3,13-diazahexacyclo[14.7.0.0^{2,10}.0^{4,9}.0^{11,...)
Affinity DataIC50:  40nM. Assay description: The MLK1, MLK2, and MLK3 assays were performed using the Millipore multiscreen trichloroacetic acid (TCA) in-plate format. IC50 values were calculate...
In DepthDetails ArticlePubMed