BDBM142091 US8933056, Ala-boroAla Thioxamide
SMILES C[C@H](N)C(=S)N[C@@H](C)B(O)O
InChI Key InChIKey=BTELILDAVLHMTG-IMJSIDKUSA-N
Data  2 IC50
  Tab Delimited (TSV)   2D SDfile   Computed 3D by Vconf -m prep SDfile
Find this compound or compounds like it in BindingDB:
Activity Spreadsheet -- Enzyme Inhibition Constant Data from BindingDB
Found 2 hits for monomerid = 142091
TargetDipeptidyl peptidase 4(Homo sapiens (Human))
Trustees Of Tufts College
US Patent
LigandPNGBDBM142091(US8933056, Ala-boroAla Thioxamide)
Affinity DataIC50:  7.70E+3nMpH: 8.0Assay Description:The inhibitor solution is prepared by dissolving 3-5 mg of inhibitor in pH 2 solution (0.01 N HCl), such that the concentration of the solution is eq...
Ligand InfoPC cidPC sid
In DepthDetails US Patent
TargetDipeptidyl peptidase 4(Homo sapiens (Human))
Trustees Of Tufts College
US Patent
LigandPNGBDBM142091(US8933056, Ala-boroAla Thioxamide)
Affinity DataIC50:  6.50E+3nMpH: 2.0Assay Description:The inhibitor solution is prepared by dissolving 3-5 mg of inhibitor in pH 2 solution (0.01 N HCl), such that the concentration of the solution is eq...
Ligand InfoPC cidPC sid
In DepthDetails US Patent