BDBM142102 US8933056, Aad-boroPro
SMILES CCC[C@H](N)C(=O)N1CCC[C@H]1B(O)O
InChI Key InChIKey=LVJQJXNVLIWBJD-YUMQZZPRSA-N
Data  2 IC50
  Tab Delimited (TSV)   2D SDfile   Computed 3D by Vconf -m prep SDfile
Find this compound or compounds like it in BindingDB:
Activity Spreadsheet -- Enzyme Inhibition Constant Data from BindingDB
Found 2 hits for monomerid = 142102
TargetDipeptidyl peptidase 4(Homo sapiens (Human))
Trustees Of Tufts College
US Patent
LigandPNGBDBM142102(US8933056, Aad-boroPro)
Affinity DataIC50:  7.40E+3nMpH: 8.0Assay Description:The inhibitor solution is prepared by dissolving 3-5 mg of inhibitor in pH 2 solution (0.01 N HCl), such that the concentration of the solution is eq...
In DepthDetails US Patent
TargetDipeptidyl peptidase 4(Homo sapiens (Human))
Trustees Of Tufts College
US Patent
LigandPNGBDBM142102(US8933056, Aad-boroPro)
Affinity DataIC50:  4.5nMpH: 2.0Assay Description:The inhibitor solution is prepared by dissolving 3-5 mg of inhibitor in pH 2 solution (0.01 N HCl), such that the concentration of the solution is eq...
In DepthDetails US Patent