BDBM142113 US8933079, 2.1
SMILES Cc1cc(CN2CCCC2)ccc1C(=O)Cn1ccc(OCc2ccc(F)cn2)cc1=O
InChI Key InChIKey=ATCWIJNCEOEKPT-UHFFFAOYSA-N
Data  1 IC50
  Tab Delimited (TSV)   2D SDfile   Computed 3D by Vconf -m prep SDfile
Find this compound or compounds like it in BindingDB:
Activity Spreadsheet -- Enzyme Inhibition Constant Data from BindingDB
Found 1 hit for monomerid = 142113
TargetMelanin-concentrating hormone receptor 1(Homo sapiens (Human))
Boehringer Ingelheim International
US Patent
LigandPNGBDBM142113(US8933079, 2.1)
Affinity DataIC50:  67nMpH: 7.0Assay Description:Membranes from CHO/Galpha16 cells stably transfected with human hMCH-1R are resuspended using a syringe (needle 0.6x25 mm) and diluted in test buffer...
In DepthDetails US Patent