BDBM14226 3-(carboxymethoxy)-7-chloro-1-benzothiophene-2-carboxylic acid::benzothiophene 16
SMILES OC(=O)COc1c(sc2c(Cl)cccc12)C(O)=O
InChI Key InChIKey=KLQJHVXSQREJKC-UHFFFAOYSA-N
Data  1 KI
  Tab Delimited (TSV)   2D SDfile   Computed 3D by Vconf -m prep SDfile
Find this compound or compounds like it in BindingDB:
Activity Spreadsheet -- Enzyme Inhibition Constant Data from BindingDB
Found 1 hit for monomerid = 14226
TargetTyrosine-protein phosphatase non-receptor type 1 [1-298](Homo sapiens (Human))
Wyeth Research
LigandPNGBDBM14226(3-(carboxymethoxy)-7-chloro-1-benzothiophene-2-car...)
Affinity DataKi:  1.19E+5nM ΔG°:  -5.35kcal/moleT: 2°C. Assay description: The enzymatic assay was carried out at room temperature in 96-well plates. The initial rate of PTPase-catalyzed hydrolysis of p-nitrophenol phosphate...
In DepthDetails ArticlePubMed