BDBM14234 5-(carboxymethoxy)-10-[(cyclohexylmethyl)amino]-3,7-dithiatricyclo[6.4.0.0^{2,6}]dodeca-1(8),2(6),4,9,11-pentaene-4-carboxylic acid::thienobenzothiophene 24
SMILES OC(=O)COc1c(sc2c1sc1cc(NCC3CCCCC3)ccc21)C(O)=O
InChI Key InChIKey=RAAYMVZICJRQFW-UHFFFAOYSA-N
Data  1 KI
  Tab Delimited (TSV)   2D SDfile   Computed 3D by Vconf -m prep SDfile
Find this compound or compounds like it in BindingDB:
Activity Spreadsheet -- Enzyme Inhibition Constant Data from BindingDB
Found 1 hit for monomerid = 14234
TargetTyrosine-protein phosphatase non-receptor type 1 [1-298](Homo sapiens (Human))
Wyeth Research
LigandPNGBDBM14234(5-(carboxymethoxy)-10-[(cyclohexylmethyl)amino]-3,...)
Affinity DataKi:  680nM ΔG°:  -8.41kcal/moleT: 2°C. Assay description: The enzymatic assay was carried out at room temperature in 96-well plates. The initial rate of PTPase-catalyzed hydrolysis of p-nitrophenol phosphate...
In DepthDetails ArticlePubMed