BDBM142611 US8933228, 27
SMILES CC(C)(C)c1cc(NC(=O)Nc2ccc(Oc3ccnc4[nH]c(=O)cnc34)c3ccccc23)n(n1)-c1ccc(Cl)cc1
InChI Key InChIKey=DAXMIVDYBBFSGN-UHFFFAOYSA-N
Data  4 IC50
  Tab Delimited (TSV)   2D SDfile   Computed 3D by Vconf -m prep SDfile
Find this compound or compounds like it in BindingDB:
Activity Spreadsheet -- Enzyme Inhibition Constant Data from BindingDB
Found 4 hits for monomerid = 142611
TargetMitogen-activated protein kinase 14(Homo sapiens (Human))
Respivert
US Patent
LigandPNGBDBM142611(US8933228, 27)
Affinity DataIC50:  3nM. Assay description: The enzyme inhibitory activity of test compounds was determined by fluorescence resonance energy transfer (FRET) using synthetic peptides labelled wi...
In DepthDetails US Patent
TargetProto-oncogene tyrosine-protein kinase Src(Homo sapiens (Human))
Respivert
US Patent
LigandPNGBDBM142611(US8933228, 27)
Affinity DataIC50:  16nM. Assay description: The enzyme inhibitory activity of test compounds was determined by fluorescence resonance energy transfer (FRET) using synthetic peptides labelled wi...
In DepthDetails US Patent
TargetTyrosine-protein kinase HCK(Homo sapiens (Human))
Respivert
US Patent
LigandPNGBDBM142611(US8933228, 27)
Affinity DataIC50:  918nM. Assay description: The enzyme inhibitory activity of test compounds was determined by fluorescence resonance energy transfer (FRET) using synthetic peptides labelled wi...
In DepthDetails US Patent
TargetMitogen-activated protein kinase 12(Homo sapiens (Human))
Respivert
US Patent
LigandPNGBDBM142611(US8933228, 27)
Affinity DataIC50:  237nM. Assay description: The enzyme inhibitory activity of test compounds was determined by fluorescence resonance energy transfer (FRET) using synthetic peptides labelled wi...
In DepthDetails US Patent