BDBM142688 US8937068, 181
SMILES CCNC(=O)Nc1ccc2ncc(Nc3cnccn3)nc2n1
InChI Key InChIKey=PKTVDIKAWBOBHE-UHFFFAOYSA-N
Data  4 IC50
  Tab Delimited (TSV)   2D SDfile   Computed 3D by Vconf -m prep SDfile
Find this compound or compounds like it in BindingDB:
Activity Spreadsheet -- Enzyme Inhibition Constant Data from BindingDB
Found 4 hits for monomerid = 142688
TargetMitogen-activated protein kinase 1(Homo sapiens (Human))
Zentaris
US Patent
LigandPNGBDBM142688(US8937068, 181)
Affinity DataIC50:  1.70E+3nM. Assay description: The inhibitory effect of the compounds according to the invention was tested on various serine/threonine, tyrosine and lipid kinases in enzymatic ass...
In DepthDetails US Patent
TargetMitogen-activated protein kinase 8/9(Homo sapiens (Human))
Zentaris
US Patent
LigandPNGBDBM142688(US8937068, 181)
Affinity DataIC50:  4.30E+3nM. Assay description: The inhibitory effect of the compounds according to the invention was tested on various serine/threonine, tyrosine and lipid kinases in enzymatic ass...
In DepthDetails US Patent
TargetMitogen-activated protein kinase 14(Homo sapiens (Human))
Zentaris
US Patent
LigandPNGBDBM142688(US8937068, 181)
Affinity DataIC50: >1.00E+5nM. Assay description: The inhibitory effect of the compounds according to the invention was tested on various serine/threonine, tyrosine and lipid kinases in enzymatic ass...
In DepthDetails US Patent
LigandPNGBDBM142688(US8937068, 181)
Affinity DataIC50:  739nM. Assay description: The inhibitory effect of the compounds according to the invention was tested on various serine/threonine, tyrosine and lipid kinases in enzymatic ass...
In DepthDetails US Patent