BDBM142860 US10487086, Example 11::US11136327, Example 11::US8940720, 11::US9802939, 11
SMILES COC(=O)Nc1ccc2-c3c[nH]c(n3)[C@H](CCCCCNc2c1)NC(=O)\C=C\c1cc(Cl)ccc1-n1cnnn1
InChI Key
Data  5 KI
  Tab Delimited (TSV)   2D SDfile   Computed 3D by Vconf -m prep SDfile
Find this compound or compounds like it in BindingDB:
Activity Spreadsheet -- Enzyme Inhibition Constant Data from BindingDB
Found 5 hits for monomerid = 142860
TargetCoagulation factor XI(Homo sapiens (Human))
Bristol-Myers Squibb
US Patent
LigandPNGBDBM142860(US10487086, Example 11 | US11136327, Example 11 | ...)
Affinity DataKi:  6nM. Assay description: The effectiveness of compounds of the present invention as inhibitors of the coagulation Factors XIa, VIIa, IXa, Xa, XIIa, plasma kallikrein or throm...
In DepthDetails US Patent
TargetCoagulation factor XI(Homo sapiens (Human))
Bristol-Myers Squibb
US Patent
LigandPNGBDBM142860(US10487086, Example 11 | US11136327, Example 11 | ...)
Affinity DataKi:  6nM. Assay description: Factor XIa determinations were made in 50 mM HEPES buffer at pH 7.4 containing 145 mM NaCl, 5 mM KCl, and 0.1% PEG 8000 (polyethylene glycol; JT Bake...
In DepthDetails US Patent
TargetCoagulation factor XI(Homo sapiens (Human))
Bristol-Myers Squibb
US Patent
LigandPNGBDBM142860(US10487086, Example 11 | US11136327, Example 11 | ...)
Affinity DataKi:  6nM. Assay description: Factor XIa determinations were made in 50 mM HEPES buffer at pH 7.4 containing 145 mM NaCl, 5 mM KCl, and 0.1% PEG 8000 (polyethylene glycol; JT Bake...
In DepthDetails US Patent
TargetCoagulation factor XI(Homo sapiens (Human))
Bristol-Myers Squibb
US Patent
LigandPNGBDBM142860(US10487086, Example 11 | US11136327, Example 11 | ...)
Affinity DataKi:  6nM. Assay description: The effectiveness of compounds of the present invention as inhibitors of the coagulation Factors XIa, VIIa, IXa, Xa, XIIa, plasma kallikrein or throm...
In DepthDetails US Patent
TargetCoagulation factor XI(Homo sapiens (Human))
Bristol-Myers Squibb
US Patent
LigandPNGBDBM142860(US10487086, Example 11 | US11136327, Example 11 | ...)
Affinity DataKi:  16nM. Assay description: Inhibition of recombinant human activated coagulation factor XI using pyro-Glu-Pro-Arg-pNA as substrate by spectrophotometry
In DepthDetails ArticlePubMed