BDBM142869 US10487086, Example 137::US11136327, Example 137::US8940720, 137::US9802939, 137
SMILES COC(=O)Nc1ccc2-c3c[nH]c(n3)[C@H](CC(O)C(O)CC(=O)Nc2c1)NC(=O)\C=C\c1cc(Cl)ccc1-n1cnnn1
InChI Key
Data  4 KI
  Tab Delimited (TSV)   2D SDfile   Computed 3D by Vconf -m prep SDfile
Find this compound or compounds like it in BindingDB:
Activity Spreadsheet -- Enzyme Inhibition Constant Data from BindingDB
Found 4 hits for monomerid = 142869
TargetCoagulation factor XI(Homo sapiens (Human))
Bristol-Myers Squibb
US Patent
LigandPNGBDBM142869(US10487086, Example 137 | US11136327, Example 137 ...)
Affinity DataKi:  192nM. Assay description: The effectiveness of compounds of the present invention as inhibitors of the coagulation Factors XIa, VIIa, IXa, Xa, XIIa, plasma kallikrein or throm...
In DepthDetails US Patent
TargetCoagulation factor XI(Homo sapiens (Human))
Bristol-Myers Squibb
US Patent
LigandPNGBDBM142869(US10487086, Example 137 | US11136327, Example 137 ...)
Affinity DataKi:  192nM. Assay description: Factor XIa determinations were made in 50 mM HEPES buffer at pH 7.4 containing 145 mM NaCl, 5 mM KCl, and 0.1% PEG 8000 (polyethylene glycol; JT Bake...
In DepthDetails US Patent
TargetCoagulation factor XI(Homo sapiens (Human))
Bristol-Myers Squibb
US Patent
LigandPNGBDBM142869(US10487086, Example 137 | US11136327, Example 137 ...)
Affinity DataKi:  192nM. Assay description: The effectiveness of compounds of the present invention as inhibitors of the coagulation Factors XIa, VIIa, IXa, Xa, XIIa, plasma kallikrein or throm...
In DepthDetails US Patent
TargetCoagulation factor XI(Homo sapiens (Human))
Bristol-Myers Squibb
US Patent
LigandPNGBDBM142869(US10487086, Example 137 | US11136327, Example 137 ...)
Affinity DataKi:  192nM. Assay description: Factor XIa determinations were made in 50 mM HEPES buffer at pH 7.4 containing 145 mM NaCl, 5 mM KCl, and 0.1% PEG 8000 (polyethylene glycol; JT Bake...
In DepthDetails US Patent