BDBM14292 5-{4-[(2S)-2-(1H-1,3-benzodiazol-2-yl)-2-(1,3-benzothiazol-2-ylamino)ethyl]-2-fluorophenyl}-1,2-thiazolidine-1,1,3-trione::IZD deriv. 28
SMILES Fc1cc(C[C@H](Nc2nc3ccccc3s2)c2nc3ccccc3[nH]2)ccc1C1CC(=O)NS1(=O)=O
InChI Key InChIKey=WPUFGGKRENZYJA-AIBWNMTMSA-N
Data  1 IC50
  Tab Delimited (TSV)   2D SDfile   Computed 3D by Vconf -m prep SDfile
Find this compound or compounds like it in BindingDB:
Activity Spreadsheet -- Enzyme Inhibition Constant Data from BindingDB
Found 1 hit for monomerid = 14292
LigandPNGBDBM14292(5-{4-[(2S)-2-(1H-1,3-benzodiazol-2-yl)-2-(1,3-benz...)
Affinity DataIC50:  230nM. Assay description: The activity of PTP1B enzyme was assayed with 4-nitrophenyl phosphate (pNPP) as substrate. Rate of formation of the phenolate ion was monitored at 41...
In DepthDetails ArticlePubMed