BDBM14303 benzthiazole analog 6::benzyl N-[(2S)-3-[(3R)-3-aminopyrrolidin-1-yl]-1-(1,3-benzothiazol-2-yl)-1-oxopropan-2-yl]carbamate
SMILES N[C@@H]1CCN(C[C@H](NC(=O)OCc2ccccc2)C(=O)c2nc3ccccc3s2)C1
InChI Key InChIKey=BBBYWFUMYGUGBH-AEFFLSMTSA-N
Data  2 KI
  Tab Delimited (TSV)   2D SDfile   Computed 3D by Vconf -m prep SDfile
Find this compound or compounds like it in BindingDB:
Activity Spreadsheet -- Enzyme Inhibition Constant Data from BindingDB
Found 2 hits for monomerid = 14303
TargetSerine protease 1(Bos taurus (bovine))
Celera
LigandPNGBDBM14303(benzthiazole analog 6 | benzyl N-[(2S)-3-[(3R)-3-a...)
Affinity DataKi: >1.50E+5nM. Assay description: Each enzyme was assayed with a set of different concentrations of each inhibitor. After addition of the appropriate substrate, the rate of hydrolysis...
In DepthDetails ArticlePubMed
TargetTryptase beta-2(Homo sapiens (Human))
Celera
LigandPNGBDBM14303(benzthiazole analog 6 | benzyl N-[(2S)-3-[(3R)-3-a...)
Affinity DataKi: >1.50E+5nM ΔG°: >-5.16kcal/molepH: 7.4 T: 2°C. Assay description: Each enzyme was assayed with a set of different concentrations of each inhibitor. After addition of the appropriate substrate, the rate of hydrolysis...
In DepthDetails ArticlePubMed