BDBM143302 US9682953, 5.A-6
SMILES FC(F)(F)S(=O)(=O)c1ccc(Oc2cccc(C=C3CCC(CC3)NC(=O)c3ccc(nc3)-n3cccn3)c2)nc1
InChI Key InChIKey=WTSPSVYTCDFCMP-CYVLTUHYSA-N
Data  2 IC50
  Tab Delimited (TSV)   2D SDfile   Computed 3D by Vconf -m prep SDfile
Find this compound or compounds like it in BindingDB:
Activity Spreadsheet -- Enzyme Inhibition Constant Data from BindingDB
Found 2 hits for monomerid = 143302
TargetFatty-acid amide hydrolase 1 [30-579](Rattus norvegicus (rat))
Advinus Therapeutics
US Patent
LigandPNGBDBM143302(US9682953, 5.A-6)
Affinity DataIC50:  7nMpH: 7.4 T: 2°C. Assay description: All reagents were purchased from Sigma-Aldrich unless specified. Human and Rat Fatty Acid Amide Hydrolase (FAAH) genes used in assay have been descri...
Ligand InfoPC cidPC sid
In DepthDetails US Patent
TargetFatty-acid amide hydrolase 1(Homo sapiens (Human))
Advinus Therapeutics
US Patent
LigandPNGBDBM143302(US9682953, 5.A-6)
Affinity DataIC50:  7nMpH: 7.4 T: 2°C. Assay description: All reagents were purchased from Sigma-Aldrich unless specified. Human and Rat Fatty Acid Amide Hydrolase (FAAH) genes used in assay have been descri...
Ligand InfoPC cidPC sid
In DepthDetails US Patent