BDBM143690 4-(3-(2,4-dihydroxy-3-methylphenyl)-3- (2,4-dihydroxyphenyl)propane-1-one (33)
SMILES Cc1c(O)ccc(C(=O)CCc2ccc(O)cc2O)c1O
InChI Key InChIKey=KJKZYJLGPSIBBT-UHFFFAOYSA-N
Data  1 IC50
  Tab Delimited (TSV)   2D SDfile   Computed 3D by Vconf -m prep SDfile
Find this compound or compounds like it in BindingDB:
Activity Spreadsheet -- Enzyme Inhibition Constant Data from BindingDB
Found 1 hit for monomerid = 143690
TargetCell surface glycoprotein MUC18(Mouse)
Unigen
US Patent
LigandPNGBDBM143690(4-(3-(2,4-dihydroxy-3-methylphenyl)-3- (2,4-dihydr...)
Affinity DataIC50:  2.54E+3nMT: 2°C. Assay description: All test compounds were initially dissolved in 100% DMSO at a concentration of 400 mM. The compounds were further diluted in 100% DMSO to a concentra...
Ligand InfoPC cidPC sid
In DepthDetails US Patent