BDBM144182 US8969335, A2
SMILES CN1CCC(CC1)n1cc(Nc2cc(ccn2)-c2ccc(OC3CCOCC3)c(c2)C#N)cn1
InChI Key InChIKey=DGPQTKIPTWLNAJ-UHFFFAOYSA-N
Data  2 IC50
  Tab Delimited (TSV)   2D SDfile   Computed 3D by Vconf -m prep SDfile
Find this compound or compounds like it in BindingDB:
Activity Spreadsheet -- Enzyme Inhibition Constant Data from BindingDB
Found 2 hits for monomerid = 144182
TargetInhibitor of nuclear factor kappa-B kinase subunit epsilon(Homo sapiens (Human))
Merck Patent
US Patent
LigandPNGBDBM144182(US8969335, A2)
Affinity DataIC50:  20nMpH: 7.5 T: 2°C. Assay description: 1 nM IKKe, 800 nM biotinylated IkBalpha(19-42) peptide (Biotin-C6-C6-GLKKERLLDDRHDSGLDSMKDEE) and 10 μM ATP (spiked with 0.3 uCi of 33P-ATP/well) ar...
In DepthDetails US Patent
TargetSerine/threonine-protein kinase TBK1(Homo sapiens (Human))
Merck Patent
US Patent
LigandPNGBDBM144182(US8969335, A2)
Affinity DataIC50:  83nMpH: 7.5 T: 2°C. Assay description: The kinase assay is performed as 384-well flashplate assay (for example for Topcount measurement).0.6 nM TANK binding kinase (TBK1), 800 nM biotinyla...
In DepthDetails US Patent