BDBM144246 US8952008, 45
SMILES CCn1cnc2c(cnnc12)-c1ccc(Cl)c(c1)-c1ccc(cc1OC)S(=O)(=O)CC
InChI Key InChIKey=RDMPICBUYGOIPW-UHFFFAOYSA-N
Data  1 KI
  Tab Delimited (TSV)   2D SDfile   Computed 3D by Vconf -m prep SDfile
Find this compound or compounds like it in BindingDB:
Activity Spreadsheet -- Enzyme Inhibition Constant Data from BindingDB
Found 1 hit for monomerid = 144246
TargetGamma-aminobutyric acid receptor subunit alpha-2(Homo sapiens (Human))
Pfizer
US Patent
LigandPNGBDBM144246(US8952008, 45)
Affinity DataKi:  29.7nM. Assay description: The affinity of the test compounds was determined by radioligand competition binding assay, using the known compound [3H]Ro-15-1788 (Flumazenil) (Per...
In DepthDetails US Patent