BDBM144276 US8969333, YW4-03
SMILES ClCC(=N)NCCC[C@H](NC(=O)c1cccc(c1)-c1ccccc1)C(=O)NCc1ccccc1
InChI Key InChIKey=WLVRKBWUFKPAQU-DEOSSOPVSA-N
Data  1 IC50
  Tab Delimited (TSV)   2D SDfile   Computed 3D by Vconf -m prep SDfile
Find this compound or compounds like it in BindingDB:
Activity Spreadsheet -- Enzyme Inhibition Constant Data from BindingDB
Found 1 hit for monomerid = 144276
TargetProtein-arginine deiminase type-6(Homo sapiens (Human))
The Penn State Research Foundation
US Patent
LigandPNGBDBM144276(US8969333, YW4-03)
Affinity DataIC50:  5.00E+3nMT: 2°C. Assay description: The inhibition efficacy of PAD4 inhibitors were determined by colorimetric measurement of citrulline generated by PAD4 catalyzed citrullination of BA...
In DepthDetails US Patent