BDBM144292 US8969336, 370
SMILES CCc1nc(C(N)=O)c(Nc2ccc(N3CCC(CC3)N3CCN(C)CC3)c(c2)C(F)(F)F)nc1N[C@H]1CC[C@H](O)CC1
InChI Key InChIKey=LMAXJYJLXCUPQY-XYWHTSSQSA-N
Data  1 IC50
  Tab Delimited (TSV)   2D SDfile   Computed 3D by Vconf -m prep SDfile
Find this compound or compounds like it in BindingDB:
Activity Spreadsheet -- Enzyme Inhibition Constant Data from BindingDB
Found 1 hit for monomerid = 144292
TargetTyrosine-protein kinase receptor(Homo sapiens (Human))
Astellas Pharma
US Patent
LigandPNGBDBM144292(US8969336, 370)
Affinity DataIC50:  0.650nM. Assay description: A recombinant retrovirus was created from expression plasmid FLAG-EML4-ALKv1/pMX-iresCD8 in which cDNA for EMLA-ALK fusion protein v1 was integrated,...
In DepthDetails US Patent