BDBM144311 US8969336, 538
SMILES CN1CCN(CC1)C1CCN(CC1)c1ccc(Nc2nc(N[C@H]3CC[C@H](O)CC3)c(Cl)nc2C(N)=O)cc1C
InChI Key InChIKey=OZHDGGPIVQKPDI-XYWHTSSQSA-N
Data  1 IC50
  Tab Delimited (TSV)   2D SDfile   Computed 3D by Vconf -m prep SDfile
Find this compound or compounds like it in BindingDB:
Activity Spreadsheet -- Enzyme Inhibition Constant Data from BindingDB
Found 1 hit for monomerid = 144311
TargetTyrosine-protein kinase receptor(Homo sapiens (Human))
Astellas Pharma
US Patent
LigandPNGBDBM144311(US8969336, 538)
Affinity DataIC50:  2.30nM. Assay description: A recombinant retrovirus was created from expression plasmid FLAG-EML4-ALKv1/pMX-iresCD8 in which cDNA for EMLA-ALK fusion protein v1 was integrated,...
In DepthDetails US Patent