BDBM144344 US8969348, 2-[4-(Naphthalen-1-ylmethyl)-1-oxophthalazin-2(1H)-yl]pentanoic acid
SMILES CCCC(C(O)=O)n1nc(Cc2cccc3ccccc23)c2ccccc2c1=O
InChI Key InChIKey=KOFDKPAWXNMYGX-UHFFFAOYSA-N
Data  1 IC50
  Tab Delimited (TSV)   2D SDfile   Computed 3D by Vconf -m prep SDfile
Find this compound or compounds like it in BindingDB:
Activity Spreadsheet -- Enzyme Inhibition Constant Data from BindingDB
Found 1 hit for monomerid = 144344
TargetChymase(Homo sapiens (Human))
Boehringer Ingelheim International
US Patent
LigandPNGBDBM144344(US8969348, 2-[4-(Naphthalen-1-ylmethyl)-1-oxophtha...)
Affinity DataIC50:  86nMpH: 8.0Assay Description:Chymase assays were performed in a total volume of 15 uL in Corning black opaque 384-well microtiter plates with a non-binding surface (Corning, N.Y....
In DepthDetails US Patent