BDBM144573 US8969568, 126
SMILES C[C@@H](Oc1nc(cc2ncccc12)-c1ccccc1)[C@H]1CNC(=O)C1
InChI Key InChIKey=MYIFTDKCEYNXDY-UKRRQHHQSA-N
Data  1 IC50
  Tab Delimited (TSV)   2D SDfile   Computed 3D by Vconf -m prep SDfile
Find this compound or compounds like it in BindingDB:
Activity Spreadsheet -- Enzyme Inhibition Constant Data from BindingDB
Found 1 hit for monomerid = 144573
TargetTyrosine-protein kinase SYK(Homo sapiens (Human))
Boehringer Ingelheim Pharma
US Patent
LigandPNGBDBM144573(US8969568, 126)
Affinity DataIC50:  0.200nM. Assay description: Recombinant human Syk (amino acids 342-635) was expressed as a fusion protein with an N-terminal GST tag, affinity-purified and deep-frozen at a conc...
In DepthDetails US Patent