BDBM144620 US8969586, 52::US9598436, 52
SMILES Clc1ccccc1-c1noc2c(cccc12)-c1cncnc1-n1cncn1
InChI Key InChIKey=XEUOARNXKJGIQG-UHFFFAOYSA-N
Data  2 IC50
  Tab Delimited (TSV)   2D SDfile   Computed 3D by Vconf -m prep SDfile
Find this compound or compounds like it in BindingDB:
Activity Spreadsheet -- Enzyme Inhibition Constant Data from BindingDB
Found 2 hits for monomerid = 144620
TargetSteroid 17-alpha-hydroxylase/17,20 lyase(Homo sapiens (Human))
Bristol-Myers Squibb
US Patent
LigandPNGBDBM144620(US8969586, 52 | US9598436, 52)
Affinity DataIC50:  42nM. Assay description: The assays were performed in U-bottom 384-well optiplates. The final assay volume was 15 μl prepared from 7.5 μl additions of microsomes (p...
Ligand InfoPC cidPC sid
In DepthDetails US Patent
TargetSteroid 17-alpha-hydroxylase/17,20 lyase(Homo sapiens (Human))
Bristol-Myers Squibb
US Patent
LigandPNGBDBM144620(US8969586, 52 | US9598436, 52)
Affinity DataIC50:  42nMpH: 7.2 T: 2°C. Assay description: The assays were performed in U-bottom 384-well optiplates. The final assay volume was 15 μl prepared from 7.5 μl additions of microsomes (p...
Ligand InfoPC cidPC sid
In DepthDetails US Patent