BDBM144626 US8969586, 99::US9598436, 99
SMILES Fc1ccc(cc1)-c1csc2c(ccnc12)-c1cncnc1C1CC1
InChI Key InChIKey=RICILNMBDFRMHP-UHFFFAOYSA-N
Data  2 IC50
  Tab Delimited (TSV)   2D SDfile   Computed 3D by Vconf -m prep SDfile
Find this compound or compounds like it in BindingDB:
Activity Spreadsheet -- Enzyme Inhibition Constant Data from BindingDB
Found 2 hits for monomerid = 144626
TargetSteroid 17-alpha-hydroxylase/17,20 lyase(Homo sapiens (Human))
Bristol-Myers Squibb
US Patent
LigandPNGBDBM144626(US8969586, 99 | US9598436, 99)
Affinity DataIC50:  4nM. Assay description: The assays were performed in U-bottom 384-well optiplates. The final assay volume was 15 μl prepared from 7.5 μl additions of microsomes (p...
In DepthDetails US Patent
TargetSteroid 17-alpha-hydroxylase/17,20 lyase(Homo sapiens (Human))
Bristol-Myers Squibb
US Patent
LigandPNGBDBM144626(US8969586, 99 | US9598436, 99)
Affinity DataIC50:  4nMpH: 7.2 T: 2°C. Assay description: The assays were performed in U-bottom 384-well optiplates. The final assay volume was 15 μl prepared from 7.5 μl additions of microsomes (p...
In DepthDetails US Patent