BDBM14470 (+)-4-(8-Chloro-3,7-dibromo-6,11-dihydro-5H-benzo-[5,6]cyclohepta[1,2-b]pyridin-11(R)-yl)-1-(4-pyridinyl-acetyl)-piperidine N1-Oxide::4-(2-{4-[(2R)-6,12-dibromo-13-chloro-4-azatricyclo[9.4.0.0^{3,8}]pentadeca-1(11),3,5,7,12,14-hexaen-2-yl]piperidin-1-yl}-2-oxoethyl)-1-oxidopyridin-1-ium::Trihalobenzocycloheptapyridine Tricyclic Compound 47
SMILES [O-][n+]1ccc(CC(=O)N2CCC(CC2)[C@@H]2c3ccc(Cl)c(Br)c3CCc3cc(Br)cnc23)cc1
InChI Key InChIKey=NJUJMRKMMSIRJG-XMMPIXPASA-N
Data  1 IC50
  Tab Delimited (TSV)   2D SDfile   Computed 3D by Vconf -m prep SDfile
Find this compound or compounds like it in BindingDB:
Activity Spreadsheet -- Enzyme Inhibition Constant Data from BindingDB
Found 1 hit for monomerid = 14470
TargetProtein farnesyltransferase subunit beta/geranylgeranyltransferase type-1 subunit alpha(Homo sapiens (Human))
Schering-Plough Research Institute
LigandPNGBDBM14470((+)-4-(8-Chloro-3,7-dibromo-6,11-dihydro-5H-benzo-...)
Affinity DataIC50:  62nMpH: 7.5 T: 2°C. Assay description: FPT activity was determined by measuring transfer of [3H] farnesyl from [3H]farnesyl pyrophosphate to the substrate His6-Ha-Ras-CVLS. The incorporate...
In DepthDetails ArticlePubMed