BDBM144828 US8952157, 9::US9303025, 9
SMILES OCc1cccc(Oc2cc(ccc2C(=O)NS(=O)(=O)c2ccc(NCCCN3CCOCC3)c(c2)[N+]([O-])=O)N2CCN(Cc3ccccc3-c3ccc(Cl)cc3)CC2)c1
InChI Key InChIKey=XNMSQAKVCQKVST-UHFFFAOYSA-N
Data  2 KI
  Tab Delimited (TSV)   2D SDfile   Computed 3D by Vconf -m prep SDfile
Find this compound or compounds like it in BindingDB:
Activity Spreadsheet -- Enzyme Inhibition Constant Data from BindingDB
Found 2 hits for monomerid = 144828
TargetApoptosis regulator Bcl-2(Homo sapiens (Human))
Abbvie
US Patent
LigandPNGBDBM144828(US8952157, 9 | US9303025, 9)
Affinity DataKi:  0.754nM ΔG°:  -12.4kcal/moleT: 2°C. Assay description: Representative compounds were serially diluted in dimethyl sulfoxide (DMSO) starting at 50 μM (2× starting concentration; 10% DMSO) and 10 μ...
In DepthDetails US Patent
TargetApoptosis regulator Bcl-2(Homo sapiens (Human))
Abbvie
US Patent
LigandPNGBDBM144828(US8952157, 9 | US9303025, 9)
Affinity DataKi:  0.754nM ΔG°:  -12.4kcal/moleT: 2°C. Assay description: Representative compounds were serially diluted in dimethyl sulfoxide (DMSO) starting at 50 uM (2x starting concentration; 10% DMSO) and 10 uL were tr...
In DepthDetails US Patent