BDBM145227 US8952169, 6::US9771376, Example 6
SMILES CS(=O)(=O)NC(=O)c1cc(Cl)c(OCC23CC4CC(CC(C4)C2)C3)cc1F
InChI Key InChIKey=BPBGIOCKNVNDRU-UHFFFAOYSA-N
Data  15 IC50
  Tab Delimited (TSV)   2D SDfile   Computed 3D by Vconf -m prep SDfile
Find this compound or compounds like it in BindingDB:
Activity Spreadsheet -- Enzyme Inhibition Constant Data from BindingDB
Found 24 hits for monomerid = 145227
TargetSodium channel protein type 9 subunit alpha(Homo sapiens (Human))
Xenon Pharmaceuticals
US Patent
LigandPNGBDBM145227(US8952169, 6 | US9771376, Example 6)
Affinity DataIC50:  29nMpH: 7.4 T: 2°C. Assay description: Radioligand Binding Studies: Saturation experiments. A representative compound of formula (I) was tritiated. Three tritiums were incorporated in plac...
In DepthDetails US Patent
TargetSodium channel protein type 9 subunit alpha(Homo sapiens (Human))
Xenon Pharmaceuticals
US Patent
LigandPNGBDBM145227(US8952169, 6 | US9771376, Example 6)
Affinity DataIC50:  70nM
In DepthDetails
TargetSodium channel protein type 9 subunit alpha(Homo sapiens (Human))
Xenon Pharmaceuticals
US Patent
LigandPNGBDBM145227(US8952169, 6 | US9771376, Example 6)
Affinity DataIC50:  5.5nMT: 2°C. Assay description: Patch voltage clamp electrophysiology allows for the direct measurement and quantification of block of voltage-gated sodium channels (NaV's), and all...
In DepthDetails US Patent
TargetSodium channel protein type 9 subunit alpha(Homo sapiens (Human))
Xenon Pharmaceuticals
US Patent
LigandPNGBDBM145227(US8952169, 6 | US9771376, Example 6)
Affinity DataIC50:  5.5nM. Assay description: The following patch voltage clamp electrophysiology studies were performed on representative compounds of the invention using human embryonic kidney ...
In DepthDetails US Patent
TargetSodium channel protein type 5 subunit alpha(Homo sapiens (Human))
Genentech
US Patent
LigandPNGBDBM145227(US8952169, 6 | US9771376, Example 6)
Affinity DataIC50:  1.91E+3nM. Assay description: The following patch voltage clamp electrophysiology studies were performed on representative compounds of the invention using human embryonic kidney ...
In DepthDetails US Patent
TargetSodium channel protein type 9 subunit alpha(Homo sapiens (Human))
Xenon Pharmaceuticals
US Patent
LigandPNGBDBM145227(US8952169, 6 | US9771376, Example 6)
Affinity DataIC50:  3.80nM. Assay description: Inhibition of Nav1.7 (unknown origin) by PatchXpress method
In DepthDetails ArticlePubMed
TargetSodium channel protein type 5 subunit alpha(Homo sapiens (Human))
Genentech
US Patent
LigandPNGBDBM145227(US8952169, 6 | US9771376, Example 6)
Affinity DataIC50:  1.07E+3nM. Assay description: Inhibition of Nav1.5 (unknown origin) by PatchXpress method
In DepthDetails ArticlePubMed
TargetSodium channel protein type 9 subunit alpha(Homo sapiens (Human))
Xenon Pharmaceuticals
US Patent
LigandPNGBDBM145227(US8952169, 6 | US9771376, Example 6)
Affinity DataIC50:  2.74E+4nM. Assay description: Inhibition of inactivated state of recombinant human NaV1.7 R1608A mutant expressed in HEK293 cell membranes coexpressing Nav beta1 subunit assessed ...
In DepthDetails ArticlePubMed
TargetSodium channel protein type 9 subunit alpha(Homo sapiens (Human))
Xenon Pharmaceuticals
US Patent
LigandPNGBDBM145227(US8952169, 6 | US9771376, Example 6)
Affinity DataIC50:  8.87E+3nM. Assay description: Inhibition of inactivated state of recombinant human NaV1.7 R1605A mutant expressed in HEK293 cell membranes coexpressing Nav beta1 subunit assessed ...
In DepthDetails ArticlePubMed
TargetSodium channel protein type 9 subunit alpha(Homo sapiens (Human))
Xenon Pharmaceuticals
US Patent
LigandPNGBDBM145227(US8952169, 6 | US9771376, Example 6)
Affinity DataIC50:  40nM. Assay description: Inhibition of inactivated state of recombinant human NaV1.7 Y1537A mutant expressed in HEK293 cell membranes coexpressing Nav beta1 subunit assessed ...
In DepthDetails ArticlePubMed
TargetSodium channel protein type 9 subunit alpha(Homo sapiens (Human))
Xenon Pharmaceuticals
US Patent
LigandPNGBDBM145227(US8952169, 6 | US9771376, Example 6)
Affinity DataIC50:  70nM. Assay description: Displacement of [3H]GX-545 from recombinant human NaV1.7 expressed in HEK293 cell membranes coexpressing Nav beta1 subunit after 18 hrs by liquid sci...
In DepthDetails ArticlePubMed
TargetSodium channel protein type 5 subunit alpha(Homo sapiens (Human))
Genentech
US Patent
LigandPNGBDBM145227(US8952169, 6 | US9771376, Example 6)
Affinity DataIC50:  1.90E+3nM. Assay description: Inhibition of full length human NaV1.5 expressed in HEK293 cells coexpressing Nav beta1 subunit assessed as decrease in sodium current amplitude by P...
In DepthDetails ArticlePubMed
TargetSodium channel protein type 9 subunit alpha(Homo sapiens (Human))
Xenon Pharmaceuticals
US Patent
LigandPNGBDBM145227(US8952169, 6 | US9771376, Example 6)
Affinity DataIC50:  1.37E+3nM. Assay description: Inhibition of inactivated state of recombinant human NaV1.7 R1602A mutant expressed in HEK293 cell membranes coexpressing Nav beta1 subunit assessed ...
In DepthDetails ArticlePubMed
TargetSodium channel protein type 9 subunit alpha(Homo sapiens (Human))
Xenon Pharmaceuticals
US Patent
LigandPNGBDBM145227(US8952169, 6 | US9771376, Example 6)
Affinity DataIC50:  4nM. Assay description: Inhibition of inactivated state of recombinant wild type human NaV1.7 expressed in HEK293 cell membranes coexpressing Nav beta1 subunit assessed as d...
In DepthDetails ArticlePubMed
TargetSodium channel protein type 9 subunit alpha(Homo sapiens (Human))
Xenon Pharmaceuticals
US Patent
LigandPNGBDBM145227(US8952169, 6 | US9771376, Example 6)
Affinity DataIC50:  6nM. Assay description: Inhibition of full length human NaV1.7 expressed in HEK293 cells coexpressing Nav beta1 subunit assessed as decrease in sodium current amplitude by P...
In DepthDetails ArticlePubMed
TargetSodium channel protein type 9 subunit alpha(Homo sapiens (Human))
Xenon Pharmaceuticals
US Patent
LigandPNGBDBM145227(US8952169, 6 | US9771376, Example 6)
Affinity DataIC50:  6nM
In DepthDetails
TargetSodium channel protein type 5 subunit alpha(Homo sapiens (Human))
Genentech
US Patent
LigandPNGBDBM145227(US8952169, 6 | US9771376, Example 6)
Affinity DataIC50:  1.90E+3nM
In DepthDetails
TargetCytochrome P450 3A4(Homo sapiens (Human))TBA
LigandPNGBDBM145227(US8952169, 6 | US9771376, Example 6)
Affinity DataIC50: >1.00E+4nM
In DepthDetails
TargetCytochrome P450 1A2(Homo sapiens (Human))TBA
LigandPNGBDBM145227(US8952169, 6 | US9771376, Example 6)
Affinity DataIC50: >1.00E+4nM
In DepthDetails
TargetCytochrome P450 2C19(Homo sapiens (Human))TBA
LigandPNGBDBM145227(US8952169, 6 | US9771376, Example 6)
Affinity DataIC50: >1.00E+4nM
In DepthDetails
TargetCytochrome P450 2C9(Homo sapiens (Human))TBA
LigandPNGBDBM145227(US8952169, 6 | US9771376, Example 6)
Affinity DataIC50: >1.00E+4nM
In DepthDetails
TargetCytochrome P450 2D6(Homo sapiens (Human))TBA
LigandPNGBDBM145227(US8952169, 6 | US9771376, Example 6)
Affinity DataIC50: >1.00E+4nM
In DepthDetails
LigandPNGBDBM145227(US8952169, 6 | US9771376, Example 6)
Affinity DataIC50: >1.00E+4nM
In DepthDetails
TargetSodium channel protein type 5 subunit alpha(Homo sapiens (Human))
Genentech
US Patent
LigandPNGBDBM145227(US8952169, 6 | US9771376, Example 6)
Affinity DataIC50:  1.90E+3nMT: 2°C. Assay description: Patch voltage clamp electrophysiology allows for the direct measurement and quantification of block of voltage-gated sodium channels (NaV's), and all...
In DepthDetails US Patent