BDBM145249 US8952169, 28::US9771376, Example 28
SMILES CS(=O)(=O)NC(=O)c1cc(Cl)c(OCC23CC4CC(CC(O)(C4)C2)C3)cc1F
InChI Key InChIKey=UHUZZNIIDVTJII-UHFFFAOYSA-N
Data  3 IC50
  Tab Delimited (TSV)   2D SDfile   Computed 3D by Vconf -m prep SDfile
Find this compound or compounds like it in BindingDB:
Activity Spreadsheet -- Enzyme Inhibition Constant Data from BindingDB
Found 5 hits for monomerid = 145249
TargetSodium channel protein type 9 subunit alpha(Homo sapiens (Human))
Xenon Pharmaceuticals
US Patent
LigandPNGBDBM145249(US8952169, 28 | US9771376, Example 28)
Affinity DataIC50:  1.00E+4nMpH: 7.4 T: 2°C. Assay description: Radioligand Binding Studies: Saturation experiments. A representative compound of formula (I) was tritiated. Three tritiums were incorporated in plac...
In DepthDetails US Patent
TargetSodium channel protein type 9 subunit alpha(Homo sapiens (Human))
Xenon Pharmaceuticals
US Patent
LigandPNGBDBM145249(US8952169, 28 | US9771376, Example 28)
Affinity DataIC50:  2.25E+3nMT: 2°C. Assay description: Patch voltage clamp electrophysiology allows for the direct measurement and quantification of block of voltage-gated sodium channels (NaV's), and all...
In DepthDetails US Patent
TargetSodium channel protein type 9 subunit alpha(Homo sapiens (Human))
Xenon Pharmaceuticals
US Patent
LigandPNGBDBM145249(US8952169, 28 | US9771376, Example 28)
Affinity DataIC50: >1.00E+4nM
In DepthDetails
TargetSodium channel protein type 9 subunit alpha(Homo sapiens (Human))
Xenon Pharmaceuticals
US Patent
LigandPNGBDBM145249(US8952169, 28 | US9771376, Example 28)
Affinity DataIC50:  2.20E+3nM
In DepthDetails
TargetSodium channel protein type 9 subunit alpha(Homo sapiens (Human))
Xenon Pharmaceuticals
US Patent
LigandPNGBDBM145249(US8952169, 28 | US9771376, Example 28)
Affinity DataIC50:  2.25E+3nM. Assay description: The following patch voltage clamp electrophysiology studies were performed on representative compounds of the invention using human embryonic kidney ...
In DepthDetails US Patent