BDBM145310 US8952169, 89
SMILES CN(C)S(=O)(=O)NC(=O)c1cc(Cl)c(OCC23CC4CC(CC(F)(C4)C2)C3)cc1F
InChI Key InChIKey=FHELIIFTHZLVNX-UHFFFAOYSA-N
Data  1 IC50
  Tab Delimited (TSV)   2D SDfile   Computed 3D by Vconf -m prep SDfile
Find this compound or compounds like it in BindingDB:
Activity Spreadsheet -- Enzyme Inhibition Constant Data from BindingDB
Found 1 hit for monomerid = 145310
TargetSodium channel protein type 9 subunit alpha(Homo sapiens (Human))
Xenon Pharmaceuticals
US Patent
LigandPNGBDBM145310(US8952169, 89)
Affinity DataIC50:  234nMpH: 7.4 T: 2°C. Assay description: Radioligand Binding Studies: Saturation experiments. A representative compound of formula (I) was tritiated. Three tritiums were incorporated in plac...
In DepthDetails US Patent