BDBM145347 US8952169, 126::US8952169, 128::US9771376, Example 128
SMILES CS(=O)(=O)NC(=O)c1cc(Cl)c(OC2CCC(CC2)C(F)(F)F)cc1F
InChI Key InChIKey=BWBCZPZIZMDKGY-UHFFFAOYSA-N
Data  4 IC50
  Tab Delimited (TSV)   2D SDfile   Computed 3D by Vconf -m prep SDfile
Find this compound or compounds like it in BindingDB:
Activity Spreadsheet -- Enzyme Inhibition Constant Data from BindingDB
Found 4 hits for monomerid = 145347
TargetSodium channel protein type 9 subunit alpha(Homo sapiens (Human))
Xenon Pharmaceuticals
US Patent
LigandPNGBDBM145347(US8952169, 126 | US8952169, 128 | US9771376, Examp...)
Affinity DataIC50:  392nMpH: 7.4 T: 2°C. Assay description: Radioligand Binding Studies: Saturation experiments. A representative compound of formula (I) was tritiated. Three tritiums were incorporated in plac...
In DepthDetails US Patent
TargetSodium channel protein type 9 subunit alpha(Homo sapiens (Human))
Xenon Pharmaceuticals
US Patent
LigandPNGBDBM145347(US8952169, 126 | US8952169, 128 | US9771376, Examp...)
Affinity DataIC50:  30.3nM. Assay description: The following patch voltage clamp electrophysiology studies were performed on representative compounds of the invention using human embryonic kidney ...
In DepthDetails US Patent
TargetSodium channel protein type 9 subunit alpha(Homo sapiens (Human))
Xenon Pharmaceuticals
US Patent
LigandPNGBDBM145347(US8952169, 126 | US8952169, 128 | US9771376, Examp...)
Affinity DataIC50:  30.3nMT: 2°C. Assay description: Patch voltage clamp electrophysiology allows for the direct measurement and quantification of block of voltage-gated sodium channels (NaV's), and all...
In DepthDetails US Patent
TargetSodium channel protein type 9 subunit alpha(Homo sapiens (Human))
Xenon Pharmaceuticals
US Patent
LigandPNGBDBM145347(US8952169, 126 | US8952169, 128 | US9771376, Examp...)
Affinity DataIC50:  291nMpH: 7.4 T: 2°C. Assay description: Radioligand Binding Studies: Saturation experiments. A representative compound of formula (I) was tritiated. Three tritiums were incorporated in plac...
In DepthDetails US Patent