BDBM145373 US8952169, 152::US9771376, Example 152
SMILES CS(=O)(=O)NC(=O)c1cc(Cl)c(OCC23CC4CC(C2)C(F)(F)C(C4)C3)cc1F
InChI Key InChIKey=QZJPBYOXZWCBAN-UHFFFAOYSA-N
Data  3 IC50
  Tab Delimited (TSV)   2D SDfile   Computed 3D by Vconf -m prep SDfile
Find this compound or compounds like it in BindingDB:
Activity Spreadsheet -- Enzyme Inhibition Constant Data from BindingDB
Found 3 hits for monomerid = 145373
TargetSodium channel protein type 9 subunit alpha(Homo sapiens (Human))
Xenon Pharmaceuticals
US Patent
LigandPNGBDBM145373(US8952169, 152 | US9771376, Example 152)
Affinity DataIC50:  27nMpH: 7.4 T: 2°C. Assay description: Radioligand Binding Studies: Saturation experiments. A representative compound of formula (I) was tritiated. Three tritiums were incorporated in plac...
In DepthDetails US Patent
TargetSodium channel protein type 9 subunit alpha(Homo sapiens (Human))
Xenon Pharmaceuticals
US Patent
LigandPNGBDBM145373(US8952169, 152 | US9771376, Example 152)
Affinity DataIC50:  10.6nM. Assay description: The following patch voltage clamp electrophysiology studies were performed on representative compounds of the invention using human embryonic kidney ...
In DepthDetails US Patent
TargetSodium channel protein type 9 subunit alpha(Homo sapiens (Human))
Xenon Pharmaceuticals
US Patent
LigandPNGBDBM145373(US8952169, 152 | US9771376, Example 152)
Affinity DataIC50:  10.6nMT: 2°C. Assay description: Patch voltage clamp electrophysiology allows for the direct measurement and quantification of block of voltage-gated sodium channels (NaV's), and all...
In DepthDetails US Patent