BDBM145861 US8956589, 30
SMILES COC(=O)CCC(C(=O)\C=C\c1ccco1)C(=O)\C=C\c1ccc(O)c(OC(F)(F)F)c1
InChI Key InChIKey=GEWHBCNCXGBFPA-GZFKCFCKSA-N
Data  1 IC50
  Tab Delimited (TSV)   2D SDfile   Computed 3D by Vconf -m prep SDfile
Find this compound or compounds like it in BindingDB:
Activity Spreadsheet -- Enzyme Inhibition Constant Data from BindingDB
Found 1 hit for monomerid = 145861
TargetAmyloid-beta precursor protein(Homo sapiens (Human))
Shiga University Of Medical Science
US Patent
LigandPNGBDBM145861(US8956589, 30)
Affinity DataIC50:  650nMpH: 7.5 T: 2°C. Assay description: First, amyloid beta peptides (1-40, Peptide Institute, Minoh-shi, Osaka) were dissolved in a 50 mM phosphate buffer containing 100 mM sodium chloride...
In DepthDetails US Patent