BDBM14610 N-pyrazinylurea Analog 8e::methyl 3-[(2-chloro-4-{[(5-cyanopyrazin-2-yl)carbamoyl]amino}-5-methoxyphenyl)carbamoyl]propanoate
SMILES COC(=O)CCC(=O)Nc1cc(OC)c(NC(=O)Nc2cnc(cn2)C#N)cc1Cl
InChI Key InChIKey=CWEBUAQYDWVSRV-UHFFFAOYSA-N
Data  1 IC50
  Tab Delimited (TSV)   2D SDfile   Computed 3D by Vconf -m prep SDfile
Find this compound or compounds like it in BindingDB:
Activity Spreadsheet -- Enzyme Inhibition Constant Data from BindingDB
Found 1 hit for monomerid = 14610
TargetSerine/threonine-protein kinase Chk1(Homo sapiens (Human))
Abbott Laboratories
LigandPNGBDBM14610(N-pyrazinylurea Analog 8e | methyl 3-[(2-chloro-4-...)
Affinity DataIC50:  15nMpH: 7.4 T: 2°C. Assay description: Chk1 kinase activity was assayed in reaction buffer containing substrate, enzyme, and inhibitor in the presence of 5uM ATP/[gamma-33P] ATP. 33P incor...
In DepthDetails ArticlePubMed