BDBM14659 (3Z)-6-(4-methylphenyl)-3-(1H-pyrrol-3-ylmethylidene)-2,3-dihydro-1H-indol-2-one::indolinone analog 23
SMILES Cc1ccc(cc1)-c1ccc2\C(=C\c3cc[nH]c3)C(=O)Nc2c1
InChI Key InChIKey=NRRZKUNXPQKYFS-ZDLGFXPLSA-N
Data  1 IC50
  Tab Delimited (TSV)   2D SDfile   Computed 3D by Vconf -m prep SDfile
Find this compound or compounds like it in BindingDB:
Activity Spreadsheet -- Enzyme Inhibition Constant Data from BindingDB
Found 1 hit for monomerid = 14659
TargetSerine/threonine-protein kinase Chk1(Homo sapiens (Human))
Abbott Laboratories
LigandPNGBDBM14659((3Z)-6-(4-methylphenyl)-3-(1H-pyrrol-3-ylmethylide...)
Affinity DataIC50: >1.00E+4nMpH: 7.4 T: 2°C. Assay description: Chk1 kinase activity was assayed in reaction buffer containing substrate, enzyme, and inhibitor in the presence of 5uM ATP/[gamma-33P] ATP. 33P incor...
In DepthDetails ArticlePubMed