BDBM146696 US8957073, 4.30::US9718803, 4.30
SMILES CC(C)Oc1cc(F)cc(c1)-c1nccnc1C1CN(C1)c1ccc2ccccc2n1
InChI Key InChIKey=ACALNZBAXMJCAY-UHFFFAOYSA-N
Data  2 IC50
  Tab Delimited (TSV)   2D SDfile   Computed 3D by Vconf -m prep SDfile
Find this compound or compounds like it in BindingDB:
Activity Spreadsheet -- Enzyme Inhibition Constant Data from BindingDB
Found 2 hits for monomerid = 146696
TargetcAMP and cAMP-inhibited cGMP 3',5'-cyclic phosphodiesterase 10A(Homo sapiens (Human))
Amgen
US Patent
LigandPNGBDBM146696(US8957073, 4.30 | US9718803, 4.30)
Affinity DataIC50:  0.0110nMT: 2°C. Assay description: An IMAP TR-FRET assay was used to analyze the enzyme activity (Molecular Devices Corp., Sunnyvale Calif.). 5 L of serial diluted PDE10A (BPS Bioscien...
In DepthDetails US Patent
TargetcAMP and cAMP-inhibited cGMP 3',5'-cyclic phosphodiesterase 10A(Homo sapiens (Human))
Amgen
US Patent
LigandPNGBDBM146696(US8957073, 4.30 | US9718803, 4.30)
Affinity DataIC50:  0.0110nMT: 2°C. Assay description: Enzyme Activity. An IMAP TR-FRET assay was used to analyze the enzyme activity (Molecular Devices Corp., Sunnyvale Calif.). 5 uL of serial diluted PD...
In DepthDetails US Patent