BDBM146923 US8957073, 29.4::US9718803, 29.4
SMILES COc1cccc(c1)-c1nccnc1C1CN(C1)c1ccc2ccc(F)cc2n1
InChI Key InChIKey=VSEMUCYQFVCUGF-UHFFFAOYSA-N
Data  2 IC50
  Tab Delimited (TSV)   2D SDfile   Computed 3D by Vconf -m prep SDfile
Find this compound or compounds like it in BindingDB:
Activity Spreadsheet -- Enzyme Inhibition Constant Data from BindingDB
Found 2 hits for monomerid = 146923
TargetcAMP and cAMP-inhibited cGMP 3',5'-cyclic phosphodiesterase 10A(Homo sapiens (Human))
Amgen
US Patent
LigandPNGBDBM146923(US8957073, 29.4 | US9718803, 29.4)
Affinity DataIC50:  1.22nMT: 2°C. Assay description: An IMAP TR-FRET assay was used to analyze the enzyme activity (Molecular Devices Corp., Sunnyvale Calif.). 5 L of serial diluted PDE10A (BPS Bioscien...
In DepthDetails US Patent
TargetcAMP and cAMP-inhibited cGMP 3',5'-cyclic phosphodiesterase 10A(Homo sapiens (Human))
Amgen
US Patent
LigandPNGBDBM146923(US8957073, 29.4 | US9718803, 29.4)
Affinity DataIC50:  1.22nMT: 2°C. Assay description: Enzyme Activity. An IMAP TR-FRET assay was used to analyze the enzyme activity (Molecular Devices Corp., Sunnyvale Calif.). 5 uL of serial diluted PD...
In DepthDetails US Patent