BDBM147133 US8957075, Table 1 Compound 28
SMILES O=C(C(NS(=O)(=O)c1ccc2[nH]c(=O)ccc2c1)c1ccccc1)N(Cc1ccco1)Cc1cccs1
InChI Key
Data  1 Kd
  Tab Delimited (TSV)   2D SDfile   Computed 3D by Vconf -m prep SDfile
Find this compound or compounds like it in BindingDB:
Activity Spreadsheet -- Enzyme Inhibition Constant Data from BindingDB
Found 1 hit for monomerid = 147133
TargetUDP-N-acetylglucosamine--peptide N-acetylglucosaminyltransferase 110 kDa subunit(Homo sapiens (Human))
President And Fellows Of Harvard College
US Patent
LigandPNGBDBM147133(US8957075, Table 1 Compound 28)
Affinity DataKd:  400nM. Assay description: 384-well plates (Costar #3654) were filled using a liquid handling robot with 20 uL of a mixture of 50 nM of a fluorescein-linked UDP-GlcNAc analog (...
Ligand InfoPC cidPC sid
In DepthDetails US Patent