BDBM147207 US8957093, 16
SMILES COC(=O)c1ccc(CNC(=O)c2ccc3n(Cc4ccc(cc4)-c4ccccc4C(O)=O)c(C)c(C)c3c2)cc1
InChI Key InChIKey=JKEOQQHYKJOZQG-UHFFFAOYSA-N
Data  1 IC50
  Tab Delimited (TSV)   2D SDfile   Computed 3D by Vconf -m prep SDfile
Find this compound or compounds like it in BindingDB:
Activity Spreadsheet -- Enzyme Inhibition Constant Data from BindingDB
Found 1 hit for monomerid = 147207
TargetPeroxisome proliferator-activated receptor gamma(Homo sapiens (Human))
The Scripps Research Institute
US Patent
LigandPNGBDBM147207(US8957093, 16)
Affinity DataIC50:  2nM. Assay description: The assay was performed according to manufacturer protocol. A mixture of nM GST-PPARG-LBD, 5 nM Tb-GST-antibody, 5 nM Fluormone Pan-PPAR Green, and s...
In DepthDetails US Patent