BDBM147416 US8957093, 254
SMILES C[C@H](NC(=O)c1ccc2n(Cc3ccc(cc3)-c3ccccc3C(O)=O)c(C)c(C)c2c1)c1ccccc1Br
InChI Key InChIKey=AMSXUORYXQSRID-NRFANRHFSA-N
Data  2 IC50  1 EC50
  Tab Delimited (TSV)   2D SDfile   Computed 3D by Vconf -m prep SDfile
Find this compound or compounds like it in BindingDB:
Activity Spreadsheet -- Enzyme Inhibition Constant Data from BindingDB
Found 3 hits for monomerid = 147416
TargetPeroxisome proliferator-activated receptor gamma(Homo sapiens (Human))
The Scripps Research Institute
US Patent
LigandPNGBDBM147416(US8957093, 254)
Affinity DataIC50:  1nM. Assay description: The assay was performed according to manufacturer protocol. A mixture of nM GST-PPARG-LBD, 5 nM Tb-GST-antibody, 5 nM Fluormone Pan-PPAR Green, and s...
In DepthDetails US Patent
TargetPeroxisome proliferator-activated receptor gamma(Homo sapiens (Human))
The Scripps Research Institute
US Patent
LigandPNGBDBM147416(US8957093, 254)
Affinity DataEC50:  147nM. Assay description: Transactivation of human PPARgamma in HEK293T cells after 18 hrs by luciferase reporter gene assay
In DepthDetails ArticlePubMed
TargetPeroxisome proliferator-activated receptor gamma(Homo sapiens (Human))
The Scripps Research Institute
US Patent
LigandPNGBDBM147416(US8957093, 254)
Affinity DataIC50:  1nM. Assay description: Binding affinity to GST-tagged PPAR-gamma-LBD (unknown origin) after 2 hrs by Lantha screen assay using fluormone Pan-PPAR green probe
In DepthDetails ArticlePubMed