BDBM147752 US8962608, 28-68
SMILES C[C@@](O)(c1ccc(Nc2nn(cc2C(N)=O)[C@H]2CC[C@@H](C[C@@H]2C#N)N2CC(C)(C)C2)cc1)C(F)(F)F
InChI Key InChIKey=MYSFLKGHFISJQR-SRGHPSETSA-N
Data  2 IC50
  Tab Delimited (TSV)   2D SDfile   Computed 3D by Vconf -m prep SDfile
Find this compound or compounds like it in BindingDB:
Activity Spreadsheet -- Enzyme Inhibition Constant Data from BindingDB
Found 2 hits for monomerid = 147752
TargetTyrosine-protein kinase JAK2(Homo sapiens (Human))
Merck Sharp & Dohme
US Patent
LigandPNGBDBM147752(US8962608, 28-68)
Affinity DataIC50:  1nM. Assay description: The ability of compounds to inhibit the activity of JAK1, JAK2, JAK3, and Tyk2 was measured using a recombinant purified GST-tagged catalytic domain ...
In DepthDetails US Patent
TargetTyrosine-protein kinase JAK1(Homo sapiens (Human))
Merck Sharp & Dohme
US Patent
LigandPNGBDBM147752(US8962608, 28-68)
Affinity DataIC50:  0.0600nM. Assay description: The ability of compounds to inhibit the activity of JAK1, JAK2, JAK3, and Tyk2 was measured using a recombinant purified GST-tagged catalytic domain ...
In DepthDetails US Patent