BDBM148123 US8962609, DMX-64
SMILES CN(C)CCNc1ccc(Nc2nccc(n2)-c2ccc(N3CCC(CC3)C(N)=O)c(c2)C#N)cn1
InChI Key InChIKey=XQDYTMWSHHRIQF-UHFFFAOYSA-N
Data  2 IC50
  Tab Delimited (TSV)   2D SDfile   Computed 3D by Vconf -m prep SDfile
Find this compound or compounds like it in BindingDB:
Activity Spreadsheet -- Enzyme Inhibition Constant Data from BindingDB
Found 2 hits for monomerid = 148123
TargetInhibitor of nuclear factor kappa-B kinase subunit epsilon(Homo sapiens (Human))
Domainex
US Patent
LigandPNGBDBM148123(US8962609, DMX-64)
Affinity DataIC50: <30nMpH: 7.5Assay Description:Inhibitions studies were performed using a time-resolved fluorescence-based Lanthascreen assay. Phosphorylation of a fluorescein-labelled substrate p...
In DepthDetails US Patent
TargetSerine/threonine-protein kinase TBK1(Homo sapiens (Human))
Domainex
US Patent
LigandPNGBDBM148123(US8962609, DMX-64)
Affinity DataIC50: <300nMpH: 7.5Assay Description:Inhibitions studies were performed using a time-resolved fluorescence-based Lanthascreen assay. Phosphorylation of a fluorescein-labelled substrate p...
In DepthDetails US Patent