BDBM148304 US9682960, EM-8977
SMILES Cc1c(Cl)c(ccc1N1C(=O)C(C)(C)N(CCCOc2ccc(cc2)-c2ccncc2Cl)C1=S)C#N
InChI Key InChIKey=LNJAQILTIPPGQA-UHFFFAOYSA-N
Data  1 IC50
  Tab Delimited (TSV)   2D SDfile   Computed 3D by Vconf -m prep SDfile
Find this compound or compounds like it in BindingDB:
Activity Spreadsheet -- Enzyme Inhibition Constant Data from BindingDB
Found 1 hit for monomerid = 148304
TargetAndrogen receptor(Mus musculus)
Endorecherche
US Patent
LigandPNGBDBM148304(US9682960, EM-8977)
Affinity DataIC50:  100nMpH: 7.4 T: 2°C. Assay description: Androgen binding is measured using the hydroxylapatite (HAP) assay. In brief, the radioactive steroid [3H]R1881 solubilized in ethanol is diluted wit...
Ligand InfoPC cidPC sid
In DepthDetails US Patent