BDBM148316 US9682960, EM-9301
SMILES Cc1c(Cl)c(ccc1N1C(=O)N(CCCOc2ccc(cc2F)-c2cc[n+]([O-])cc2)C(C)(C)C1=O)C#N
InChI Key InChIKey=ALXSLQVROBGJNV-UHFFFAOYSA-N
Data  1 IC50
  Tab Delimited (TSV)   2D SDfile   Computed 3D by Vconf -m prep SDfile
Find this compound or compounds like it in BindingDB:
Activity Spreadsheet -- Enzyme Inhibition Constant Data from BindingDB
Found 1 hit for monomerid = 148316
TargetAndrogen receptor(Mus musculus)
Endorecherche
US Patent
LigandPNGBDBM148316(US9682960, EM-9301)
Affinity DataIC50:  56nMpH: 7.4 T: 2°C. Assay description: Androgen binding is measured using the hydroxylapatite (HAP) assay. In brief, the radioactive steroid [3H]R1881 solubilized in ethanol is diluted wit...
Ligand InfoPC cidPC sid
In DepthDetails US Patent