BDBM148321 US8962637, 45
SMILES CN1CCN(CC1)c1ccc(Nc2ncc3C(=O)N(CCc3n2)c2cc(NC(=O)c3cccc(c3)C(F)(F)F)ccc2C)cc1
InChI Key InChIKey=WVGSOXRZIVSEQO-UHFFFAOYSA-N
Data  3 IC50
  Tab Delimited (TSV)   2D SDfile   Computed 3D by Vconf -m prep SDfile
Find this compound or compounds like it in BindingDB:
Activity Spreadsheet -- Enzyme Inhibition Constant Data from BindingDB
Found 3 hits for monomerid = 148321
TargetTyrosine-protein kinase JAK2(Homo sapiens (Human))
Debiopharm
US Patent
LigandPNGBDBM148321(US8962637, 45)
Affinity DataIC50:  15nM. Assay description: Compounds were screened in the TR-FRET assay for JAK2 and c-Src kinase inhibition. Ultra light poly GT (Perkin Elmer) was used as the substrate for J...
In DepthDetails US Patent
TargetProto-oncogene tyrosine-protein kinase Src(Homo sapiens (Human))
Debiopharm
US Patent
LigandPNGBDBM148321(US8962637, 45)
Affinity DataIC50:  10nM. Assay description: Compounds were screened in the TR-FRET assay for JAK2 and c-Src kinase inhibition. Ultra light poly GT (Perkin Elmer) was used as the substrate for J...
In DepthDetails US Patent
TargetTyrosine-protein kinase JAK1(Homo sapiens (Human))
Debiopharm
US Patent
LigandPNGBDBM148321(US8962637, 45)
Affinity DataIC50:  116nM. Assay description: Compounds were screened in the TR-FRET assay for JAK2 and c-Src kinase inhibition. Ultra light poly GT (Perkin Elmer) was used as the substrate for J...
In DepthDetails US Patent