BDBM148338 US9682960, EM-8991
SMILES CC1(C)N(CCCOc2ccc3cccnc3c2)C(=S)N(C1=O)c1ccc(C#N)c(c1)C(F)(F)F
InChI Key InChIKey=VUCOIZCPGQFUFB-UHFFFAOYSA-N
Data  1 IC50
  Tab Delimited (TSV)   2D SDfile   Computed 3D by Vconf -m prep SDfile
Find this compound or compounds like it in BindingDB:
Activity Spreadsheet -- Enzyme Inhibition Constant Data from BindingDB
Found 1 hit for monomerid = 148338
TargetAndrogen receptor(Mus musculus)
Endorecherche
US Patent
LigandPNGBDBM148338(US9682960, EM-8991)
Affinity DataIC50:  39nMpH: 7.4 T: 2°C. Assay description: Androgen binding is measured using the hydroxylapatite (HAP) assay. In brief, the radioactive steroid [3H]R1881 solubilized in ethanol is diluted wit...
Ligand InfoPC cidPC sid
In DepthDetails US Patent