BDBM148343 US8962637, 69::US8962637, 77
SMILES Cc1ccc(NC(=O)c2cccc(c2)C(F)(F)F)cc1N1CCc2nc(Nc3ccc(cc3)C(=O)NCCCN3CCCC3)ncc2C1=O
InChI Key InChIKey=LQDFDTOGFMACSQ-UHFFFAOYSA-N
Data  1 IC50
  Tab Delimited (TSV)   2D SDfile   Computed 3D by Vconf -m prep SDfile
Find this compound or compounds like it in BindingDB:
Activity Spreadsheet -- Enzyme Inhibition Constant Data from BindingDB
Found 1 hit for monomerid = 148343
TargetProto-oncogene tyrosine-protein kinase Src(Homo sapiens (Human))
Debiopharm
US Patent
LigandPNGBDBM148343(US8962637, 69 | US8962637, 77)
Affinity DataIC50:  17nM. Assay description: Compounds were screened in the TR-FRET assay for JAK2 and c-Src kinase inhibition. Ultra light poly GT (Perkin Elmer) was used as the substrate for J...
In DepthDetails US Patent